[Lustre-devel] Fail to build Lustre on SUSE11

kelly.zhang at emc.com kelly.zhang at emc.com
Wed May 30 03:44:03 PDT 2012


There is a compiling error when building Lustre rpms on SUSE11, at "make rpms". Would you please help to check this.
The error is like:
/home/build/kernel/rpmbuild/BUILD/lustre-2.2.52/lustre/llite/llite_lib.c: In function "ll_setattr_raw":
/home/build/kernel/rpmbuild/BUILD/lustre-2.2.52/lustre/llite/llite_lib.c:1343: error: implicit declaration of function "inode_newsize_ok "
make[8]: *** [/home/build/kernel/rpmbuild/BUILD/lustre-2.2.52/lustre/llite/llite_lib.o] Error 1
make[7]: *** [/home/build/kernel/rpmbuild/BUILD/lustre-2.2.52/lustre/llite] Error 2
make[6]: *** [/home/build/kernel/rpmbuild/BUILD/lustre-2.2.52/lustre] Error 2
make[5]: *** [_module_/home/build/kernel/rpmbuild/BUILD/lustre-2.2.52] Error 2
make[5]: Leaving directory `/var/tmp/kernel-source-'
make[4]: *** [modules] Error 2
make[4]: Leaving directory `/home/build/kernel/rpmbuild/BUILD/lustre-2.2.52'
make[3]: *** [all-recursive] Error 1
make[3]: Leaving directory `/home/build/kernel/rpmbuild/BUILD/lustre-2.2.52'
make[2]: *** [all] Error 2
make[2]: Leaving directory `/home/build/kernel/rpmbuild/BUILD/lustre-2.2.52'
error: Bad exit status from /var/tmp/rpm-tmp.54512 (%build)

RPM build errors:
    Bad exit status from /var/tmp/rpm-tmp.54512 (%build)
make[1]: *** [rpms-real] Error 1
make[1]: Leaving directory `/home/build/lustre'
make: *** [rpms] Error 2

Building machine arch: x86_64
Distribution: SUSE 11 SP1
Kernel Version used for building:

Best Regards,
-------------- next part --------------
An HTML attachment was scrubbed...
URL: <http://lists.lustre.org/pipermail/lustre-devel-lustre.org/attachments/20120530/d0660ee3/attachment.htm>

More information about the lustre-devel mailing list